{"text_format":"1","workbook":"xlsx","n_sheets":6,"sheets":["Planning Tool","Detailed Instructions","Locations of Centers","Calcs","Lookup","Rev History"],"not_rendered":{"charts":4,"images":2,"macros":1,"external_links":0,"defined_names":1,"comments":1,"pivot_tables":0},"unopened":[],"bounds":{"document_bytes":16777216,"sheet_cells":100000,"rows_first":2000,"rows_last":500,"rows_between":2000,"halvings":0,"cell_chars":16384,"cell_head_chars":4096},"cells_cut":0,"cells_raw":0,"read":"whole","date_system":"1900"}

{"sheet":"Planning Tool","index":0,"n_rows":55,"n_cols":17,"rows_kept":55,"cut":false,"hidden":false,"merged":[[9,1,9,3],[19,1,19,3],[29,1,29,3],[39,1,39,3],[49,1,49,3]]}
["Oneway Coring System Planning Tool"]
[]
[null,"Bowl Blank",null,null,null,null,null,null,null,"Core Diagram"]
[null,"dia =",null,"in  (measured across the face)"]
[null,"height =",null,"in "]
[]
[]
[null,"Core 1"]
[null,null,"Knife Number =","None",null,null,"Bowl Dia =",{"$f":"IF(ISNUMBER(Calcs!J103), Calcs!J103,\"        -\")","v":"        -"},"in"]
[null,"Locate center of Core:",null,null,null,null,"Bowl depth =",{"$f":"IF(ISNUMBER(Calcs!L103), Calcs!L103, \"        -\")","v":"        -"},"in"]
[null,null,"Dist from FO blank =",null,"in",null,"Edge thick =",{"$f":"IF(ISNUMBER(Calcs!P235), Calcs!P235, \"        -\")","v":"        -"},"in"]
[null,null,"Dist from CL of bed =",null,"in",null,"Center thick =",{"$f":"IF(ISNUMBER(Calcs!P247), Calcs!P247, \"        -\")","v":"        -"},"in"]
[null,null,null,null,null,null,"Max thick =",{"$f":"IF(ISNUMBER(Calcs!P249), Calcs!P249, \"        -\")","v":"        -"},"in"]
[null,null,null,null,null,null,"Min thick =",{"$f":"IF(ISNUMBER(Calcs!P250), Calcs!P250, \"        -\")","v":"        -"},"in"]
[null,null,null,null,null,null,"Thick Ratio =",{"$f":"IF(ISNUMBER(Calcs!P249/Calcs!P250), Calcs!P249/Calcs!P250, \"        -\")","v":"        -"}]
[]
[]
[null,"Core 2"]
[null,null,"Knife Number =","None",null,null,"Bowl Dia =",{"$f":"IF(ISNUMBER(Calcs!J284), Calcs!J284,\"        -\")","v":"        -"},"in"]
[null,"Locate center of Core:",null,null,null,null,"Bowl depth =",{"$f":"IF(ISNUMBER(Calcs!L284), Calcs!L284, \"        -\")","v":"        -"},"in"]
[null,null,"Dist from FO blank =",null,"in",null,"Edge thick =",{"$f":"IF(ISNUMBER(Calcs!P416), Calcs!P416, \"        -\")","v":"        -"},"in"]
[null,null,"Dist from CL of bed =",null,"in",null,"Center thick =",{"$f":"IF(ISNUMBER(Calcs!P428), Calcs!P428, \"        -\")","v":"        -"},"in"]
[null,null,null,null,null,null,"Max thick =",{"$f":"IF(ISNUMBER(Calcs!P430), Calcs!P430, \"        -\")","v":"        -"},"in"]
[null,null,null,null,null,null,"Min thick =",{"$f":"IF(ISNUMBER(Calcs!P431), Calcs!P431, \"        -\")","v":"        -"},"in"]
[null,null,null,null,null,null,"Max/Min thick =",{"$f":"IF(ISNUMBER(Calcs!P430/Calcs!P431), Calcs!P430/Calcs!P431, \"        -\")","v":"        -"}]
[]
[]
[null,"Core 3"]
[null,null,"Knife Number =","None",null,null,"Bowl Dia =",{"$f":"IF(ISNUMBER(Calcs!J465), Calcs!J465,\"        -\")","v":"        -"},"in"]
[null,"Locate center of Core:",null,null,null,null,"Bowl depth =",{"$f":"IF(ISNUMBER(Calcs!L465), Calcs!L465, \"        -\")","v":"        -"},"in"]
[null,null,"Dist from FO blank =",null,"in",null,"Edge thick =",{"$f":"IF(ISNUMBER(Calcs!P597), Calcs!P597, \"        -\")","v":"        -"},"in"]
[null,null,"Dist from CL of bed =",null,"in",null,"Center thick =",{"$f":"IF(ISNUMBER(Calcs!P609), Calcs!P609, \"        -\")","v":"        -"},"in"]
[null,null,null,null,null,null,"Max thick =",{"$f":"IF(ISNUMBER(Calcs!P611), Calcs!P611, \"        -\")","v":"        -"},"in"]
[null,null,null,null,null,null,"Min thick =",{"$f":"IF(ISNUMBER(Calcs!P612), Calcs!P612, \"        -\")","v":"        -"},"in"]
[null,null,null,null,null,null,"Max/Min thick =",{"$f":"IF(ISNUMBER(Calcs!P611/Calcs!P612), Calcs!P611/Calcs!P612, \"        -\")","v":"        -"},null,"Directions:"]
[null,null,null,null,null,null,null,null,null,"1.  ","Enter the diameter and height of your bowl blank."]
[null,null,null,null,null,null,null,null,null,"2.  ","Start laying out cores with the largest first. Select the Knife Number from the drop-down list below Core 1."]
[null,"Core 4",null,null,null,null,null,null,null,"3.  ","Enter values for Distance from the Face of Blank and Distance from the Centerline of the Bed."]
[null,null,"Knife Number =","None",null,null,"Bowl Dia =",{"$f":"IF(ISNUMBER(Calcs!J646), Calcs!J646,\"        -\")","v":"        -"},"in","4.  ","Review the resulting bowl diameter, depth, and thickness. Modify the Distance from the Face of Blank and "]
[null,"Locate center of Core:",null,null,null,null,"Bowl depth =",{"$f":"IF(ISNUMBER(Calcs!L646), Calcs!L646,\"        -\")","v":"        -"},"in",null,"Distance from the Centerline of the Bed until you are satisfied with the resulting core. Note that when"]
[null,null,"Dist from FO blank =",null,"in",null,"Edge thick =",{"$f":"IF(ISNUMBER(Calcs!P778), Calcs!P778, \"        -\")","v":"        -"},"in",null,"Dist from CL of bed is positive, the center is located closer to the lathe operator and the resulting core is larger than when the value is zero."]
[null,null,"Dist from CL of bed =",null,"in",null,"Center thick =",{"$f":"IF(ISNUMBER(Calcs!P790), Calcs!P790, \"        -\")","v":"        -"},"in",null,"When it is negative, the center is located farther from the lathe operator and the resulting core is smaller than when the value is zero."]
[null,null,null,null,null,null,"Max thick =",{"$f":"IF(ISNUMBER(Calcs!P792), Calcs!P792, \"        -\")","v":"        -"},"in",null,"The practical minimum value for Dist from FO blank is about 3/4\"."]
[null,null,null,null,null,null,"Min thick =",{"$f":"IF(ISNUMBER(Calcs!P793), Calcs!P793, \"        -\")","v":"        -"},"in","5.  ","Repeat for Cores 2 through 5 as desired."]
[null,null,null,null,null,null,"Max/Min thick =",{"$f":"IF(ISNUMBER(Calcs!P792/Calcs!P793), Calcs!P792/Calcs!P793, \"        -\")","v":"        -"},null,"6.  ","Use the Print Locations of Centers button to generate a plan of the lathe bed with the locations of core centers."]
[]
[]
[null,"Core 5",null,null,null,null,null,null,null,"To adjust the aspect ratio of the image above, try adjusting this number",null,null,null,null,null,null,6]
[null,null,"Knife Number =","None",null,null,"Bowl Dia =",{"$f":"IF(ISNUMBER(Calcs!J827), Calcs!J827,\"        -\")","v":"        -"},"in",null,"(Usually numbers between 5 and 10 provide a square grid and circular bowl)"]
[null,"Locate center of Core:",null,null,null,null,"Bowl depth =",{"$f":"IF(ISNUMBER(Calcs!L827), Calcs!L827,\"        -\")","v":"        -"},"in"]
[null,null,"Dist from FO blank =",null,"in",null,"Edge thick =",{"$f":"IF(ISNUMBER(Calcs!P959), Calcs!P959, \"        -\")","v":"        -"},"in"]
[null,null,"Dist from CL of bed =",null,"in",null,"Center thick =",{"$f":"IF(ISNUMBER(Calcs!P971), Calcs!P971, \"        -\")","v":"        -"},"in"]
[null,null,null,null,null,null,"Max thick =",{"$f":"IF(ISNUMBER(Calcs!P973), Calcs!P973, \"        -\")","v":"        -"},"in"]
[null,null,null,null,null,null,"Min thick =",{"$f":"IF(ISNUMBER(Calcs!P974), Calcs!P974, \"        -\")","v":"        -"},"in"]
[null,null,null,null,null,null,"Max/Min thick =",{"$f":"IF(ISNUMBER(Calcs!P973/Calcs!P974), Calcs!P973/Calcs!P974, \"        -\")","v":"        -"}]

{"sheet":"Detailed Instructions","index":1,"n_rows":15,"n_cols":18,"rows_kept":15,"cut":false,"hidden":false,"merged":[]}
["Oneway Coring System Planning Tool",null,null,null,null,null,null,null,null,null,null,null,"Ver.",0.96,"2021-10-12",null,"Stephen J. Clark","MN Woodturners"]
[]
[]
[null,"More detailed instructions to come…"]
[]
[null,"Enter the diameter and height of your bowl blank."]
[null,"Start laying out cores with the largest first. Select the Knife Number from the drop-down list below Core 1."]
[null,"Enter values for Distance from the Face of Blank and Distance from the Centerline of the Bed."]
[null,"Review the resulting bowl diameter, depth, and thickness. Modify the Distance from the Face of Blank and "]
[null,"Distance from the Centerline of the Bed until you are satisfied with the resulting core. Note that when"]
[null,"Dist from CL of bed is positive, the center is located closer to the lathe operator and the resulting core is larger than when the value is zero."]
[null,"When it is negative, the center is located farther from the lathe operator and the resulting core is smaller than when the value is zero."]
[null,"The practical minimum value for Dist from FO blank is about 3/4\"."]
[null,"Repeat for Cores 2 through 5 as desired."]
[null,"Use the Print Locations of Centers button to generate a plan of the lathe bed with the locations of core centers."]

{"sheet":"Locations of Centers","index":2,"n_rows":59,"n_cols":27,"rows_kept":59,"cut":false,"hidden":false,"merged":[[6,22,6,26]]}
[]
[]
[]
["Oneway Coring System Planning Tool",null,null,null,null,null,null,null,null,null,null,null,null,null,null,null,null,null,"Tick",null,"Lathe"]
[null,null,null,"Dist from Face","Dist from CL",null,null,null,null,null,null,null,null,null,null,null,null,null,0.15,null,2.5]
[null,null,null,"of Bowl Blank","of Lathe Bed"]
[null,null,null,"in","in",null,null,null,null,null,null,null,null,null,null,null,null,null,null,"X","Y",null,"Determine repeated coord for tick size"]
[null,{"$f":"Calcs!B96","v":"Core 1"},{"$f":"Calcs!D99","v":"None"},{"$f":"IF(C8=\"none\",\"-\",Calcs!D100)","v":"-"},{"$f":"IF(C8=\"none\", \"-\", Calcs!D101)","v":"-"},null,null,null,null,null,null,null,null,null,null,null,null,null,{"$f":"B8","v":"Core 1"},{"$f":"E8","v":"-"},{"$f":"D8","v":"-"}]
[null,{"$f":"Calcs!B277","v":"Core 2"},{"$f":"Calcs!D280","v":"None"},{"$f":"IF(C9=\"none\",\"-\",Calcs!D281)","v":"-"},{"$f":"IF(C9=\"none\",\"-\",Calcs!D282)","v":"-"},null,null,null,null,null,null,null,null,null,null,null,null,null,{"$f":"B9","v":"Core 2"},{"$f":"E9","v":"-"},{"$f":"D9","v":"-"},null,{"$f":"IF(AND((T9=T8),(U9=U8)), 1, 0)","v":1},null,null,null,{"$f":"SUM(W9:Z9)","v":1}]
[null,{"$f":"Calcs!B458","v":"Core 3"},{"$f":"Calcs!D461","v":"None"},{"$f":"IF(C10=\"none\",\"-\",Calcs!D462)","v":"-"},{"$f":"IF(C10=\"none\",\"-\",Calcs!D463)","v":"-"},null,null,null,null,null,null,null,null,null,null,null,null,null,"Core 3","-","-",null,{"$f":"IF(AND((T10=T9),(U10=U9)), 1, 0)","v":1},{"$f":"IF(AND((T10=T8),(U10=U8)), 1, 0)","v":1},null,null,{"$f":"SUM(W10:Z10)","v":2}]
[null,{"$f":"Calcs!B639","v":"Core 4"},{"$f":"Calcs!D642","v":"None"},{"$f":"IF(C11=\"none\",\"-\",Calcs!D643)","v":"-"},{"$f":"IF(C11=\"none\",\"-\",Calcs!D644)","v":"-"},null,null,null,null,null,null,null,null,null,null,null,null,null,"Core 4","-","-",null,1,{"$f":"IF(AND((T11=T9),(U11=U9)), 1, 0)","v":1},{"$f":"IF(AND((T11=T8),(U11=U8)), 1, 0)","v":1},null,3]
[null,{"$f":"Calcs!B820","v":"Core 5"},{"$f":"Calcs!D823","v":"None"},{"$f":"IF(C12=\"none\",\"-\",Calcs!D824)","v":"-"},{"$f":"IF(C12=\"none\",\"-\",Calcs!D825)","v":"-"},null,null,null,null,null,null,null,null,null,null,null,null,null,"Core 5","-","-",null,1,1,{"$f":"IF(AND((T12=T9),(U12=U9)), 1, 0)","v":1},{"$f":"IF(AND((T12=T8),(U12=U8)), 1, 0)","v":1},4]
[]
[]
[]
[null,null,null,null,null,null,null,null,null,null,null,null,null,null,null,"Lathe Bed",null,null,null,{"$f":"-U5/2","v":-1.25},0]
[null,null,null,null,null,null,null,null,null,null,null,null,null,null,null,null,null,null,null,{"$f":"T16","v":-1.25},4]
[]
[null,null,null,null,null,null,null,null,null,null,null,null,null,null,null,null,null,null,null,{"$f":"U5/2","v":1.25},{"$f":"U16","v":0}]
[null,null,null,null,null,null,null,null,null,null,null,null,null,null,null,null,null,null,null,{"$f":"T19","v":1.25},{"$f":"U17","v":4}]
[]
[null,null,null,null,null,null,null,null,null,null,null,null,null,null,null,"Face of Bowl",null,null,null,3,0]
[null,null,null,null,null,null,null,null,null,null,null,null,null,null,null,null,null,null,null,{"$f":"-T22","v":-3},{"$f":"U22","v":0}]
[]
[]
[null,null,null,null,null,null,null,null,null,null,null,null,null,null,null,null,null,null,null,"Centerline Tick"]
[null,null,null,null,null,null,null,null,null,null,null,null,null,null,null,{"$f":"B8","v":"Core 1"},{"$f":"T8","v":"-"},{"$f":"U8","v":"-"},null,{"$f":"Q27","v":"-"},{"$f":"R27-$S$5","v":{"$error":"#VALUE!"}}]
[null,null,null,null,null,null,null,null,null,null,null,null,null,null,null,null,null,null,null,{"$f":"T27","v":"-"},{"$f":"R27+$S$5","v":{"$error":"#VALUE!"}}]
[]
[null,null,null,null,null,null,null,null,null,null,null,null,null,null,null,null,null,null,null,{"$f":"Q27-$S$5","v":{"$error":"#VALUE!"}},{"$f":"R27","v":"-"}]
[null,null,null,null,null,null,null,null,null,null,null,null,null,null,null,null,null,null,null,{"$f":"Q27+$S$5","v":{"$error":"#VALUE!"}},{"$f":"U30","v":"-"}]
[]
[]
[null,null,null,null,null,null,null,null,null,null,null,null,null,null,null,{"$f":"B9","v":"Core 2"},{"$f":"T9","v":"-"},{"$f":"U9","v":"-"},null,{"$f":"Q34","v":"-"},{"$f":"R34-($S$5*0.7^(AA9))","v":{"$error":"#VALUE!"}}]
[null,null,null,null,null,null,null,null,null,null,null,null,null,null,null,null,null,null,null,{"$f":"T34","v":"-"},{"$f":"R34+($S$5*0.7^(AA9))","v":{"$error":"#VALUE!"}}]
[]
[null,null,null,null,null,null,null,null,null,null,null,null,null,null,null,null,null,null,null,{"$f":"Q34-($S$5*0.7^(AA9))","v":{"$error":"#VALUE!"}},{"$f":"R34","v":"-"}]
[null,null,null,null,null,null,null,null,null,null,null,null,null,null,null,null,null,null,null,{"$f":"Q34+($S$5*0.7^(AA9))","v":{"$error":"#VALUE!"}},{"$f":"U37","v":"-"}]
[]
[]
[null,null,null,null,null,null,null,null,null,null,null,null,null,null,null,{"$f":"B10","v":"Core 3"},{"$f":"T10","v":"-"},{"$f":"U10","v":"-"},null,{"$f":"Q41","v":"-"},{"$f":"R41-($S$5*0.7^(AA10))","v":{"$error":"#VALUE!"}}]
[null,null,null,null,null,null,null,null,null,null,null,null,null,null,null,null,null,null,null,{"$f":"T41","v":"-"},{"$f":"R41+($S$5*0.7^(AA10))","v":{"$error":"#VALUE!"}}]
[]
[null,null,null,null,null,null,null,null,null,null,null,null,null,null,null,null,null,null,null,{"$f":"Q41-($S$5*0.7^(AA10))","v":{"$error":"#VALUE!"}},{"$f":"R41","v":"-"}]
[null,null,null,null,null,null,null,null,null,null,null,null,null,null,null,null,null,null,null,{"$f":"Q41+($S$5*0.7^(AA10))","v":{"$error":"#VALUE!"}},{"$f":"U44","v":"-"}]
[]
[]
[null,null,null,null,null,null,null,null,null,null,null,null,null,null,null,{"$f":"B11","v":"Core 4"},{"$f":"T11","v":"-"},{"$f":"U11","v":"-"},null,{"$f":"Q48","v":"-"},{"$f":"R48-($S$5*0.7^(AA11))","v":{"$error":"#VALUE!"}}]
[null,null,null,null,null,null,null,null,null,null,null,null,null,null,null,null,null,null,null,{"$f":"T48","v":"-"},{"$f":"R48+($S$5*0.7^(AA11))","v":{"$error":"#VALUE!"}}]
[]
[null,null,null,null,null,null,null,null,null,null,null,null,null,null,null,null,null,null,null,{"$f":"Q48-($S$5*0.7^(AA11))","v":{"$error":"#VALUE!"}},{"$f":"R48","v":"-"}]
[null,null,null,null,null,null,null,null,null,null,null,null,null,null,null,null,null,null,null,{"$f":"Q48+($S$5*0.7^(AA11))","v":{"$error":"#VALUE!"}},{"$f":"U51","v":"-"}]
[]
[]
[null,null,null,null,null,null,null,null,null,null,null,null,null,null,null,{"$f":"B12","v":"Core 5"},{"$f":"T12","v":"-"},{"$f":"U12","v":"-"},null,{"$f":"Q55","v":"-"},{"$f":"R55-($S$5*0.7^(AA12))","v":{"$error":"#VALUE!"}}]
[null,null,null,null,null,null,null,null,null,null,null,null,null,null,null,null,null,null,null,{"$f":"T55","v":"-"},{"$f":"R55+($S$5*0.7^(AA12))","v":{"$error":"#VALUE!"}}]
[]
[null,null,null,null,null,null,null,null,null,null,null,null,null,null,null,null,null,null,null,{"$f":"Q55-($S$5*0.7^(AA12))","v":{"$error":"#VALUE!"}},{"$f":"R55","v":"-"}]
[null,null,null,null,null,null,null,null,null,null,null,null,null,null,null,null,null,null,null,{"$f":"Q55+($S$5*0.7^(AA12))","v":{"$error":"#VALUE!"}},{"$f":"U58","v":"-"}]

{"sheet":"Calcs","index":3,"n_rows":997,"n_cols":24,"rows_kept":997,"cut":false,"hidden":false,"merged":[[920,1,920,3],[654,1,654,3],[698,1,698,3],[739,1,739,3],[835,1,835,3],[879,1,879,3],[111,1,111,3],[31,1,31,3],[61,1,61,3],[155,1,155,3],[196,1,196,3],[473,1,473,3],[517,1,517,3],[558,1,558,3],[292,1,292,3],[336,1,336,3],[377,1,377,3]]}
[]
[null,"From Input Page",null,null,"Bowl d =",{"$f":"'Planning Tool'!C4","v":0},"in"]
[null,null,null,null,"Bowl ht =",{"$f":"'Planning Tool'!C5","v":0},"in"]
[]
[null,null,null,null,"Bowl d =",{"$f":"'Planning Tool'!C4","v":0},"in"]
[null,null,null,null,"Bowl ht' =",{"$f":"MIN(F3,F2/2)","v":0},"in"]
[]
[null,"CL of BB is at (0,0)"]
[]
[null,"c = Distance from CL of bed to CL of core",null,null,null,null,"If value is positive, CL of core moves toward operator and the resulting bowl is larger than the diameter of the knife."]
[null,null,null,null,null,null,"If value is negative, CL of core moves away operator and the resulting bowl is smaller than the diameter of the knife."]
[null,null,null,null,null,null,"For each core, set b equal to k in the circle equation"]
[]
[null,"f = Distance from face of BB to CL of core",null,null,null,null,"k = a - f"]
[]
[]
[null,"Bowl Blank"]
[]
[null,"Center at","x =",0,null,"y =",0]
[]
[null,null,"r =",{"$f":"F6/2 + F5^2/(8*F6)","v":{"$error":"#DIV/0!"}},"in"]
[null,null,"Angle",{"$f":"IF(D23=0,PI(),2*ATAN(F5/(2*D23)))/2","v":{"$error":"#DIV/0!"}},"rad =",{"$f":"180/PI()*D22","v":{"$error":"#DIV/0!"}},"deg"]
[null,null,"offset a =",{"$f":"D21-F6","v":{"$error":"#DIV/0!"}},"in"]
[]
[null,null,"(x-h)^2  +  (y-k)^2  =  r^2",null,null,"y = k   +/-  sqrt[ r^2  -  (x-h)^2  ] "]
[]
[null,null,"h =",0]
[null,null,"k =",0]
[null,null,"r =",{"$f":"D21","v":{"$error":"#DIV/0!"}}]
[]
[null,"Bowl Blank Coordinates in Sector 1",null,null,null,null,null,null,null,null,null,null,null,null,null,null,null,null,null,"Graph of Bowl Blank",null,null,"Bowl Blank Sector Line"]
[null,"Angle Increment"]
[null,{"$f":"MAX(B35:B46)","v":12},"rad","deg","X","Y",null,null,null,null,null,null,null,null,null,null,null,null,null,"X","Y",null,"X","Y"]
[null,0,{"$f":"(PI()/2-$D$22) + $D$22*B34/$B$33","v":{"$error":"#DIV/0!"}},{"$f":"180/PI()*C34","v":{"$error":"#DIV/0!"}},{"$f":"COS(C34) * $D$29  +$D$27","v":{"$error":"#DIV/0!"}},{"$f":"D28 + SQRT(D29^2-(E34-D27)^2)","v":{"$error":"#DIV/0!"}},null,null,null,null,null,null,null,null,null,null,null,null,null,{"$f":"E34","v":{"$error":"#DIV/0!"}},{"$f":"F34","v":{"$error":"#DIV/0!"}},null,{"$f":"T34","v":{"$error":"#DIV/0!"}},{"$f":"U34","v":{"$error":"#DIV/0!"}}]
[null,1,{"$f":"(PI()/2-$D$22) + $D$22*B35/$B$33","v":{"$error":"#DIV/0!"}},{"$f":"180/PI()*C35","v":{"$error":"#DIV/0!"}},{"$f":"COS(C35) * $D$29  +$D$27","v":{"$error":"#DIV/0!"}},{"$f":"D28 + SQRT(D29^2-(E35-D27)^2)","v":{"$error":"#DIV/0!"}},null,null,null,null,null,null,null,null,null,null,null,null,null,{"$error":"#DIV/0!"},{"$error":"#DIV/0!"},null,{"$f":"T58","v":{"$error":"#DIV/0!"}},{"$f":"U58","v":{"$error":"#DIV/0!"}}]
[null,2,{"$error":"#DIV/0!"},{"$error":"#DIV/0!"},{"$error":"#DIV/0!"},{"$f":"D28 + SQRT(D29^2-(E36-D27)^2)","v":{"$error":"#DIV/0!"}},null,null,null,null,null,null,null,null,null,null,null,null,null,{"$error":"#DIV/0!"},{"$error":"#DIV/0!"}]
[null,3,{"$error":"#DIV/0!"},{"$error":"#DIV/0!"},{"$error":"#DIV/0!"},{"$f":"D28 + SQRT(D29^2-(E37-D27)^2)","v":{"$error":"#DIV/0!"}},null,null,null,null,null,null,null,null,null,null,null,null,null,{"$error":"#DIV/0!"},{"$error":"#DIV/0!"},null,{"$f":"T44","v":{"$error":"#DIV/0!"}},{"$f":"U44","v":{"$error":"#DIV/0!"}}]
[null,4,{"$error":"#DIV/0!"},{"$error":"#DIV/0!"},{"$error":"#DIV/0!"},{"$f":"D28 + SQRT(D29^2-(E38-D27)^2)","v":{"$error":"#DIV/0!"}},null,null,null,null,null,null,null,null,null,null,null,null,null,{"$error":"#DIV/0!"},{"$error":"#DIV/0!"},null,{"$f":"W37","v":{"$error":"#DIV/0!"}},{"$f":"X37+0.3","v":{"$error":"#DIV/0!"}}]
[null,5,{"$error":"#DIV/0!"},{"$error":"#DIV/0!"},{"$error":"#DIV/0!"},{"$f":"D28 + SQRT(D29^2-(E39-D27)^2)","v":{"$error":"#DIV/0!"}},null,null,null,null,null,null,null,null,null,null,null,null,null,{"$error":"#DIV/0!"},{"$error":"#DIV/0!"},null,{"$f":"T48","v":{"$error":"#DIV/0!"}},{"$f":"X38","v":{"$error":"#DIV/0!"}}]
[null,6,{"$error":"#DIV/0!"},{"$error":"#DIV/0!"},{"$error":"#DIV/0!"},{"$f":"D28 + SQRT(D29^2-(E40-D27)^2)","v":{"$error":"#DIV/0!"}},null,null,null,null,null,null,null,null,null,null,null,null,null,{"$error":"#DIV/0!"},{"$error":"#DIV/0!"},null,{"$f":"W39","v":{"$error":"#DIV/0!"}},{"$f":"U48","v":{"$error":"#DIV/0!"}}]
[null,7,{"$error":"#DIV/0!"},{"$error":"#DIV/0!"},{"$error":"#DIV/0!"},{"$f":"D28 + SQRT(D29^2-(E41-D27)^2)","v":{"$error":"#DIV/0!"}},null,null,null,null,null,null,null,null,null,null,null,null,null,{"$error":"#DIV/0!"},{"$error":"#DIV/0!"}]
[null,8,{"$error":"#DIV/0!"},{"$error":"#DIV/0!"},{"$error":"#DIV/0!"},{"$f":"D28 + SQRT(D29^2-(E42-D27)^2)","v":{"$error":"#DIV/0!"}},null,null,null,null,null,null,null,null,null,null,null,null,null,{"$error":"#DIV/0!"},{"$error":"#DIV/0!"}]
[null,9,{"$error":"#DIV/0!"},{"$error":"#DIV/0!"},{"$error":"#DIV/0!"},{"$f":"D28 + SQRT(D29^2-(E43-D27)^2)","v":{"$error":"#DIV/0!"}},null,null,null,null,null,null,null,null,null,null,null,null,null,{"$error":"#DIV/0!"},{"$error":"#DIV/0!"}]
[null,10,{"$error":"#DIV/0!"},{"$error":"#DIV/0!"},{"$error":"#DIV/0!"},{"$f":"D28 + SQRT(D29^2-(E44-D27)^2)","v":{"$error":"#DIV/0!"}},null,null,null,null,null,null,null,null,null,null,null,null,null,{"$error":"#DIV/0!"},{"$error":"#DIV/0!"},null,"Bowl Blank Center Line"]
[null,11,{"$error":"#DIV/0!"},{"$error":"#DIV/0!"},{"$error":"#DIV/0!"},{"$f":"D28 + SQRT(D29^2-(E45-D27)^2)","v":{"$error":"#DIV/0!"}},null,null,null,null,null,null,null,null,null,null,null,null,null,{"$error":"#DIV/0!"},{"$error":"#DIV/0!"},null,"X","Y"]
[null,12,{"$error":"#DIV/0!"},{"$error":"#DIV/0!"},{"$error":"#DIV/0!"},{"$f":"D28 + SQRT(D29^2-(E46-D27)^2)","v":{"$error":"#DIV/0!"}},null,null,null,null,null,null,null,null,null,null,null,null,null,{"$error":"#DIV/0!"},{"$error":"#DIV/0!"},null,0,-0.5]
[null,null,null,null,null,null,null,null,null,null,null,null,null,null,null,null,null,null,null,{"$f":"-T45","v":{"$error":"#DIV/0!"}},{"$f":"U45","v":{"$error":"#DIV/0!"}},null,0,{"$f":"D29+0.5","v":{"$error":"#DIV/0!"}}]
[null,null,null,null,null,null,null,null,null,null,null,null,null,null,null,null,null,null,null,{"$f":"-T44","v":{"$error":"#DIV/0!"}},{"$f":"U44","v":{"$error":"#DIV/0!"}}]
[null,null,null,null,null,null,null,null,null,null,null,null,null,null,null,null,null,null,null,{"$f":"-T43","v":{"$error":"#DIV/0!"}},{"$f":"U43","v":{"$error":"#DIV/0!"}}]
[null,null,null,null,null,null,null,null,null,null,null,null,null,null,null,null,null,null,null,{"$f":"-T42","v":{"$error":"#DIV/0!"}},{"$f":"U42","v":{"$error":"#DIV/0!"}}]
[null,null,null,null,null,null,null,null,null,null,null,null,null,null,null,null,null,null,null,{"$f":"-T41","v":{"$error":"#DIV/0!"}},{"$f":"U41","v":{"$error":"#DIV/0!"}}]
[null,null,null,null,null,null,null,null,null,null,null,null,null,null,null,null,null,null,null,{"$f":"-T40","v":{"$error":"#DIV/0!"}},{"$f":"U40","v":{"$error":"#DIV/0!"}}]
[null,null,null,null,null,null,null,null,null,null,null,null,null,null,null,null,null,null,null,{"$f":"-T39","v":{"$error":"#DIV/0!"}},{"$f":"U39","v":{"$error":"#DIV/0!"}}]
[null,null,null,null,null,null,null,null,null,null,null,null,null,null,null,null,null,null,null,{"$f":"-T38","v":{"$error":"#DIV/0!"}},{"$f":"U38","v":{"$error":"#DIV/0!"}}]
[null,null,null,null,null,null,null,null,null,null,null,null,null,null,null,null,null,null,null,{"$f":"-T37","v":{"$error":"#DIV/0!"}},{"$f":"U37","v":{"$error":"#DIV/0!"}}]
[null,null,null,null,null,null,null,null,null,null,null,null,null,null,null,null,null,null,null,{"$f":"-T36","v":{"$error":"#DIV/0!"}},{"$f":"U36","v":{"$error":"#DIV/0!"}}]
[null,null,null,null,null,null,null,null,null,null,null,null,null,null,null,null,null,null,null,{"$f":"-T35","v":{"$error":"#DIV/0!"}},{"$f":"U35","v":{"$error":"#DIV/0!"}}]
[null,null,"Graph data --->",null,null,null,null,null,null,null,null,null,null,null,null,null,null,null,null,{"$f":"-T34","v":{"$error":"#DIV/0!"}},{"$f":"U34","v":{"$error":"#DIV/0!"}}]
[]
[]
{"$rows_left_out":938}
{"sheet":"Lookup","index":4,"n_rows":12,"n_cols":9,"rows_kept":12,"cut":false,"hidden":false,"merged":[]}
[]
[]
[]
[null,null,null,null,null,null,"Cutter width",0.38,"in"]
[]
[null,null,"Inside","Outside","Centerline"]
[null,"Knife","dia of cut","dia of cut","dia of cut"]
[null,"#1   -  9\"",4.625,{"$f":"C8+$H$4","v":5.0049999999999999},{"$f":"C8+$H$4/2","v":4.8150000000000004}]
[null,"#2  -  11.5\"",5.875,{"$f":"C9+$H$4","v":6.2549999999999999},{"$f":"C9+$H$4/2","v":6.0650000000000004}]
[null,"#3  -  13.5\"",7,7.38,7.19]
[null,"#4  -  16.25\"",8.125,8.5050000000000008,8.3149999999999995]
[null,"None",0,0,0]

{"sheet":"Rev History","index":5,"n_rows":9,"n_cols":11,"rows_kept":9,"cut":false,"hidden":false,"merged":[]}
[]
["Revision History"]
[null,"Ver.",0.9,"2021-01-03",null,"Stephen J. Clark","MN Woodturners",null,null,"Initial posting on MN Woodturners Blog"]
[null,null,0.95,"2021-02-27",null,null,null,null,null,"Modified formula in M235 from        IF(D235>0, J235, K235)      to     IF(D235>=0, J235, K235). Copied change to other related cells."]
[null,null,0.96,"2021-10-12",null,null,null,null,null,"Modified formula in D235 from     IF((B235-C229)=0, 1000000000000, (C235-C230) / (B235-C229))     to"]
[null,null,null,null,null,null,null,null,null,null,"IF( (B235-C229)=0, 1000000000000, IF(ABS(C235-C230)<0.00000001, 0,   (C235-C230) / (B235-C229)))"]
[null,null,null,null,null,null,null,null,null,null,"This change ensures that m never becomes slightly negative due to numerical issues. If m is negative,"]
[null,null,null,null,null,null,null,null,null,null,"the wrong root is selected for the quad eqn and the distance calculated is incorrect."]
[null,null,null,null,null,null,null,null,null,null,"Added graph to control the aspect ratio of the Planning Tool image"]